Redmine-InstallPluginsError_5.0.0.txt

HC lee, 2022-04-06 08:25

Download (52.8 KB)

 
1
redmine_questions		1.0.2	Failed
2
redmine_checklists		3.1.21	Done
3
redmineup_tags			2.0.11	Failed
4
redmine_agile			1.6.3	Done	(1.6.2 Failed)
5
redmine_dmsf			2.4.11	Failed
6
redmine_resources		1.0.6	Failed
7
redmine_drawio 			1.3.0	Failed
8
redmine_worktime		0.4.1	Done
9
redmine_subproject_collapse	0.0.1	Failed
10
advanced_roadmap		0.12.0	Failed
11
local_avatars			0.1.1	Failed
12

    
13

    
14

    
15
-----------------------------------------------------------------------------------
16
Failed-Plugins:local_avatars
17
-----------------------------------------------------------------------------------
18
----- 0.1.1 ----- (latest)
19
Traceback (most recent call last):
20
62: from bin/rails:4:in `<main>'
21
61: from bin/rails:4:in `require'
22
60: from /var/lib/gems/2.7.0/gems/railties-6.1.4.7/lib/rails/commands.rb:18:in `<top (required)>'
23
59: from /var/lib/gems/2.7.0/gems/railties-6.1.4.7/lib/rails/command.rb:48:in `invoke'
24
58: from /var/lib/gems/2.7.0/gems/railties-6.1.4.7/lib/rails/command/base.rb:69:in `perform'
25
57: from /var/lib/gems/2.7.0/gems/thor-1.2.1/lib/thor.rb:392:in `dispatch'
26
56: from /var/lib/gems/2.7.0/gems/thor-1.2.1/lib/thor/invocation.rb:127:in `invoke_command'
27
55: from /var/lib/gems/2.7.0/gems/thor-1.2.1/lib/thor/command.rb:27:in `run'
28
54: from /var/lib/gems/2.7.0/gems/railties-6.1.4.7/lib/rails/commands/server/server_command.rb:135:in `perform'
29
53: from /var/lib/gems/2.7.0/gems/railties-6.1.4.7/lib/rails/commands/server/server_command.rb:135:in `tap'
30
52: from /var/lib/gems/2.7.0/gems/railties-6.1.4.7/lib/rails/commands/server/server_command.rb:144:in `block in perform'
31
51: from /var/lib/gems/2.7.0/gems/railties-6.1.4.7/lib/rails/commands/server/server_command.rb:39:in `start'
32
50: from /var/lib/gems/2.7.0/gems/rack-2.2.3/lib/rack/server.rb:311:in `start'
33
49: from /var/lib/gems/2.7.0/gems/rack-2.2.3/lib/rack/server.rb:379:in `handle_profiling'
34
48: from /var/lib/gems/2.7.0/gems/rack-2.2.3/lib/rack/server.rb:312:in `block in start'
35
47: from /var/lib/gems/2.7.0/gems/rack-2.2.3/lib/rack/server.rb:422:in `wrapped_app'
36
46: from /var/lib/gems/2.7.0/gems/rack-2.2.3/lib/rack/server.rb:249:in `app'
37
45: from /var/lib/gems/2.7.0/gems/rack-2.2.3/lib/rack/server.rb:349:in `build_app_and_options_from_config'
38
44: from /var/lib/gems/2.7.0/gems/rack-2.2.3/lib/rack/builder.rb:66:in `parse_file'
39
43: from /var/lib/gems/2.7.0/gems/rack-2.2.3/lib/rack/builder.rb:105:in `load_file'
40
42: from /var/lib/gems/2.7.0/gems/rack-2.2.3/lib/rack/builder.rb:116:in `new_from_string'
41
41: from /var/lib/gems/2.7.0/gems/rack-2.2.3/lib/rack/builder.rb:116:in `eval'
42
40: from config.ru:3:in `block in <main>'
43
39: from /var/lib/gems/2.7.0/gems/activesupport-6.1.4.7/lib/active_support/dependencies.rb:332:in `require'
44
38: from /var/lib/gems/2.7.0/gems/activesupport-6.1.4.7/lib/active_support/dependencies.rb:299:in `load_dependency'
45
37: from /var/lib/gems/2.7.0/gems/activesupport-6.1.4.7/lib/active_support/dependencies.rb:332:in `block in require'
46
36: from /var/lib/gems/2.7.0/gems/zeitwerk-2.5.4/lib/zeitwerk/kernel.rb:35:in `require'
47
35: from /var/lib/gems/2.7.0/gems/zeitwerk-2.5.4/lib/zeitwerk/kernel.rb:35:in `require'
48
34: from /usr/share/redmine-5.0.0_plugins/config/environment.rb:16:in `<top (required)>'
49
33: from /var/lib/gems/2.7.0/gems/railties-6.1.4.7/lib/rails/application.rb:391:in `initialize!'
50
32: from /var/lib/gems/2.7.0/gems/railties-6.1.4.7/lib/rails/initializable.rb:60:in `run_initializers'
51
31: from /usr/lib/ruby/2.7.0/tsort.rb:205:in `tsort_each'
52
30: from /usr/lib/ruby/2.7.0/tsort.rb:226:in `tsort_each'
53
29: from /usr/lib/ruby/2.7.0/tsort.rb:347:in `each_strongly_connected_component'
54
28: from /usr/lib/ruby/2.7.0/tsort.rb:347:in `call'
55
27: from /usr/lib/ruby/2.7.0/tsort.rb:347:in `each'
56
26: from /usr/lib/ruby/2.7.0/tsort.rb:349:in `block in each_strongly_connected_component'
57
25: from /usr/lib/ruby/2.7.0/tsort.rb:431:in `each_strongly_connected_component_from'
58
24: from /usr/lib/ruby/2.7.0/tsort.rb:350:in `block (2 levels) in each_strongly_connected_component'
59
23: from /usr/lib/ruby/2.7.0/tsort.rb:228:in `block in tsort_each'
60
22: from /var/lib/gems/2.7.0/gems/railties-6.1.4.7/lib/rails/initializable.rb:61:in `block in run_initializers'
61
21: from /var/lib/gems/2.7.0/gems/railties-6.1.4.7/lib/rails/initializable.rb:32:in `run'
62
20: from /var/lib/gems/2.7.0/gems/railties-6.1.4.7/lib/rails/initializable.rb:32:in `instance_exec'
63
19: from /var/lib/gems/2.7.0/gems/railties-6.1.4.7/lib/rails/application/finisher.rb:124:in `block in <module:Finisher>'
64
18: from /var/lib/gems/2.7.0/gems/activesupport-6.1.4.7/lib/active_support/reloader.rb:88:in `prepare!'
65
17: from /var/lib/gems/2.7.0/gems/activesupport-6.1.4.7/lib/active_support/callbacks.rb:105:in `run_callbacks'
66
16: from /var/lib/gems/2.7.0/gems/activesupport-6.1.4.7/lib/active_support/callbacks.rb:512:in `invoke_before'
67
15: from /var/lib/gems/2.7.0/gems/activesupport-6.1.4.7/lib/active_support/callbacks.rb:512:in `each'
68
14: from /var/lib/gems/2.7.0/gems/activesupport-6.1.4.7/lib/active_support/callbacks.rb:512:in `block in invoke_before'
69
13: from /var/lib/gems/2.7.0/gems/activesupport-6.1.4.7/lib/active_support/callbacks.rb:199:in `block in halting'
70
12: from /var/lib/gems/2.7.0/gems/activesupport-6.1.4.7/lib/active_support/callbacks.rb:603:in `block in default_terminator'
71
11: from /var/lib/gems/2.7.0/gems/activesupport-6.1.4.7/lib/active_support/callbacks.rb:603:in `catch'
72
10: from /var/lib/gems/2.7.0/gems/activesupport-6.1.4.7/lib/active_support/callbacks.rb:604:in `block (2 levels) in default_terminator'
73
 9: from /var/lib/gems/2.7.0/gems/activesupport-6.1.4.7/lib/active_support/callbacks.rb:198:in `block (2 levels) in halting'
74
 8: from /var/lib/gems/2.7.0/gems/activesupport-6.1.4.7/lib/active_support/callbacks.rb:427:in `block in make_lambda'
75
 7: from /var/lib/gems/2.7.0/gems/activesupport-6.1.4.7/lib/active_support/callbacks.rb:427:in `instance_exec'
76
 6: from /usr/share/redmine-5.0.0_plugins/lib/redmine/plugin_loader.rb:108:in `block in load'
77
 5: from /usr/share/redmine-5.0.0_plugins/lib/redmine/plugin_loader.rb:108:in `each'
78
 4: from /usr/share/redmine-5.0.0_plugins/lib/redmine/plugin_loader.rb:31:in `run_initializer'
79
 3: from /usr/share/redmine-5.0.0_plugins/lib/redmine/plugin_loader.rb:31:in `load'
80
 2: from /usr/share/redmine-5.0.0_plugins/plugins/redmine_local_avatars/init.rb:27:in `<top (required)>'
81
 1: from /var/lib/gems/2.7.0/gems/zeitwerk-2.5.4/lib/zeitwerk/kernel.rb:35:in `require'
82
/var/lib/gems/2.7.0/gems/zeitwerk-2.5.4/lib/zeitwerk/kernel.rb:35:in `require': cannot load such file -- dispatcher (LoadError)
83

    
84
-----------------------------------------------------------------------------------
85
Failed-Plugins:advanced_roadmap
86
-----------------------------------------------------------------------------------
87
----- 0.12.0 ----- (latest)
88
Traceback (most recent call last):
89
62: from bin/rails:4:in `<main>'
90
61: from bin/rails:4:in `require'
91
60: from /var/lib/gems/2.7.0/gems/railties-6.1.4.7/lib/rails/commands.rb:18:in `<top (required)>'
92
59: from /var/lib/gems/2.7.0/gems/railties-6.1.4.7/lib/rails/command.rb:48:in `invoke'
93
58: from /var/lib/gems/2.7.0/gems/railties-6.1.4.7/lib/rails/command/base.rb:69:in `perform'
94
57: from /var/lib/gems/2.7.0/gems/thor-1.2.1/lib/thor.rb:392:in `dispatch'
95
56: from /var/lib/gems/2.7.0/gems/thor-1.2.1/lib/thor/invocation.rb:127:in `invoke_command'
96
55: from /var/lib/gems/2.7.0/gems/thor-1.2.1/lib/thor/command.rb:27:in `run'
97
54: from /var/lib/gems/2.7.0/gems/railties-6.1.4.7/lib/rails/commands/server/server_command.rb:135:in `perform'
98
53: from /var/lib/gems/2.7.0/gems/railties-6.1.4.7/lib/rails/commands/server/server_command.rb:135:in `tap'
99
52: from /var/lib/gems/2.7.0/gems/railties-6.1.4.7/lib/rails/commands/server/server_command.rb:144:in `block in perform'
100
51: from /var/lib/gems/2.7.0/gems/railties-6.1.4.7/lib/rails/commands/server/server_command.rb:39:in `start'
101
50: from /var/lib/gems/2.7.0/gems/rack-2.2.3/lib/rack/server.rb:311:in `start'
102
49: from /var/lib/gems/2.7.0/gems/rack-2.2.3/lib/rack/server.rb:379:in `handle_profiling'
103
48: from /var/lib/gems/2.7.0/gems/rack-2.2.3/lib/rack/server.rb:312:in `block in start'
104
47: from /var/lib/gems/2.7.0/gems/rack-2.2.3/lib/rack/server.rb:422:in `wrapped_app'
105
46: from /var/lib/gems/2.7.0/gems/rack-2.2.3/lib/rack/server.rb:249:in `app'
106
45: from /var/lib/gems/2.7.0/gems/rack-2.2.3/lib/rack/server.rb:349:in `build_app_and_options_from_config'
107
44: from /var/lib/gems/2.7.0/gems/rack-2.2.3/lib/rack/builder.rb:66:in `parse_file'
108
43: from /var/lib/gems/2.7.0/gems/rack-2.2.3/lib/rack/builder.rb:105:in `load_file'
109
42: from /var/lib/gems/2.7.0/gems/rack-2.2.3/lib/rack/builder.rb:116:in `new_from_string'
110
41: from /var/lib/gems/2.7.0/gems/rack-2.2.3/lib/rack/builder.rb:116:in `eval'
111
40: from config.ru:3:in `block in <main>'
112
39: from /var/lib/gems/2.7.0/gems/activesupport-6.1.4.7/lib/active_support/dependencies.rb:332:in `require'
113
38: from /var/lib/gems/2.7.0/gems/activesupport-6.1.4.7/lib/active_support/dependencies.rb:299:in `load_dependency'
114
37: from /var/lib/gems/2.7.0/gems/activesupport-6.1.4.7/lib/active_support/dependencies.rb:332:in `block in require'
115
36: from /var/lib/gems/2.7.0/gems/zeitwerk-2.5.4/lib/zeitwerk/kernel.rb:35:in `require'
116
35: from /var/lib/gems/2.7.0/gems/zeitwerk-2.5.4/lib/zeitwerk/kernel.rb:35:in `require'
117
34: from /usr/share/redmine-5.0.0_plugins/config/environment.rb:16:in `<top (required)>'
118
33: from /var/lib/gems/2.7.0/gems/railties-6.1.4.7/lib/rails/application.rb:391:in `initialize!'
119
32: from /var/lib/gems/2.7.0/gems/railties-6.1.4.7/lib/rails/initializable.rb:60:in `run_initializers'
120
31: from /usr/lib/ruby/2.7.0/tsort.rb:205:in `tsort_each'
121
30: from /usr/lib/ruby/2.7.0/tsort.rb:226:in `tsort_each'
122
29: from /usr/lib/ruby/2.7.0/tsort.rb:347:in `each_strongly_connected_component'
123
28: from /usr/lib/ruby/2.7.0/tsort.rb:347:in `call'
124
27: from /usr/lib/ruby/2.7.0/tsort.rb:347:in `each'
125
26: from /usr/lib/ruby/2.7.0/tsort.rb:349:in `block in each_strongly_connected_component'
126
25: from /usr/lib/ruby/2.7.0/tsort.rb:431:in `each_strongly_connected_component_from'
127
24: from /usr/lib/ruby/2.7.0/tsort.rb:350:in `block (2 levels) in each_strongly_connected_component'
128
23: from /usr/lib/ruby/2.7.0/tsort.rb:228:in `block in tsort_each'
129
22: from /var/lib/gems/2.7.0/gems/railties-6.1.4.7/lib/rails/initializable.rb:61:in `block in run_initializers'
130
21: from /var/lib/gems/2.7.0/gems/railties-6.1.4.7/lib/rails/initializable.rb:32:in `run'
131
20: from /var/lib/gems/2.7.0/gems/railties-6.1.4.7/lib/rails/initializable.rb:32:in `instance_exec'
132
19: from /var/lib/gems/2.7.0/gems/railties-6.1.4.7/lib/rails/application/finisher.rb:124:in `block in <module:Finisher>'
133
18: from /var/lib/gems/2.7.0/gems/activesupport-6.1.4.7/lib/active_support/reloader.rb:88:in `prepare!'
134
17: from /var/lib/gems/2.7.0/gems/activesupport-6.1.4.7/lib/active_support/callbacks.rb:105:in `run_callbacks'
135
16: from /var/lib/gems/2.7.0/gems/activesupport-6.1.4.7/lib/active_support/callbacks.rb:512:in `invoke_before'
136
15: from /var/lib/gems/2.7.0/gems/activesupport-6.1.4.7/lib/active_support/callbacks.rb:512:in `each'
137
14: from /var/lib/gems/2.7.0/gems/activesupport-6.1.4.7/lib/active_support/callbacks.rb:512:in `block in invoke_before'
138
13: from /var/lib/gems/2.7.0/gems/activesupport-6.1.4.7/lib/active_support/callbacks.rb:199:in `block in halting'
139
12: from /var/lib/gems/2.7.0/gems/activesupport-6.1.4.7/lib/active_support/callbacks.rb:603:in `block in default_terminator'
140
11: from /var/lib/gems/2.7.0/gems/activesupport-6.1.4.7/lib/active_support/callbacks.rb:603:in `catch'
141
10: from /var/lib/gems/2.7.0/gems/activesupport-6.1.4.7/lib/active_support/callbacks.rb:604:in `block (2 levels) in default_terminator'
142
 9: from /var/lib/gems/2.7.0/gems/activesupport-6.1.4.7/lib/active_support/callbacks.rb:198:in `block (2 levels) in halting'
143
 8: from /var/lib/gems/2.7.0/gems/activesupport-6.1.4.7/lib/active_support/callbacks.rb:427:in `block in make_lambda'
144
 7: from /var/lib/gems/2.7.0/gems/activesupport-6.1.4.7/lib/active_support/callbacks.rb:427:in `instance_exec'
145
 6: from /usr/share/redmine-5.0.0_plugins/lib/redmine/plugin_loader.rb:108:in `block in load'
146
 5: from /usr/share/redmine-5.0.0_plugins/lib/redmine/plugin_loader.rb:108:in `each'
147
 4: from /usr/share/redmine-5.0.0_plugins/lib/redmine/plugin_loader.rb:31:in `run_initializer'
148
 3: from /usr/share/redmine-5.0.0_plugins/lib/redmine/plugin_loader.rb:31:in `load'
149
 2: from /usr/share/redmine-5.0.0_plugins/plugins/advanced_roadmap/init.rb:17:in `<top (required)>'
150
 1: from /var/lib/gems/2.7.0/gems/zeitwerk-2.5.4/lib/zeitwerk/kernel.rb:35:in `require'
151
/var/lib/gems/2.7.0/gems/zeitwerk-2.5.4/lib/zeitwerk/kernel.rb:35:in `require': cannot load such file -- gravatar (LoadError)
152

    
153
-----------------------------------------------------------------------------------
154
Failed-Plugins:redmine_subproject_collapse
155
-----------------------------------------------------------------------------------
156
----- 0.0.1 ----- (latest)
157
Traceback (most recent call last):
158
63: from bin/rails:4:in `<main>'
159
62: from bin/rails:4:in `require'
160
61: from /var/lib/gems/2.7.0/gems/railties-6.1.4.7/lib/rails/commands.rb:18:in `<top (required)>'
161
60: from /var/lib/gems/2.7.0/gems/railties-6.1.4.7/lib/rails/command.rb:48:in `invoke'
162
59: from /var/lib/gems/2.7.0/gems/railties-6.1.4.7/lib/rails/command/base.rb:69:in `perform'
163
58: from /var/lib/gems/2.7.0/gems/thor-1.2.1/lib/thor.rb:392:in `dispatch'
164
57: from /var/lib/gems/2.7.0/gems/thor-1.2.1/lib/thor/invocation.rb:127:in `invoke_command'
165
56: from /var/lib/gems/2.7.0/gems/thor-1.2.1/lib/thor/command.rb:27:in `run'
166
55: from /var/lib/gems/2.7.0/gems/railties-6.1.4.7/lib/rails/commands/server/server_command.rb:135:in `perform'
167
54: from /var/lib/gems/2.7.0/gems/railties-6.1.4.7/lib/rails/commands/server/server_command.rb:135:in `tap'
168
53: from /var/lib/gems/2.7.0/gems/railties-6.1.4.7/lib/rails/commands/server/server_command.rb:144:in `block in perform'
169
52: from /var/lib/gems/2.7.0/gems/railties-6.1.4.7/lib/rails/commands/server/server_command.rb:39:in `start'
170
51: from /var/lib/gems/2.7.0/gems/rack-2.2.3/lib/rack/server.rb:311:in `start'
171
50: from /var/lib/gems/2.7.0/gems/rack-2.2.3/lib/rack/server.rb:379:in `handle_profiling'
172
49: from /var/lib/gems/2.7.0/gems/rack-2.2.3/lib/rack/server.rb:312:in `block in start'
173
48: from /var/lib/gems/2.7.0/gems/rack-2.2.3/lib/rack/server.rb:422:in `wrapped_app'
174
47: from /var/lib/gems/2.7.0/gems/rack-2.2.3/lib/rack/server.rb:249:in `app'
175
46: from /var/lib/gems/2.7.0/gems/rack-2.2.3/lib/rack/server.rb:349:in `build_app_and_options_from_config'
176
45: from /var/lib/gems/2.7.0/gems/rack-2.2.3/lib/rack/builder.rb:66:in `parse_file'
177
44: from /var/lib/gems/2.7.0/gems/rack-2.2.3/lib/rack/builder.rb:105:in `load_file'
178
43: from /var/lib/gems/2.7.0/gems/rack-2.2.3/lib/rack/builder.rb:116:in `new_from_string'
179
42: from /var/lib/gems/2.7.0/gems/rack-2.2.3/lib/rack/builder.rb:116:in `eval'
180
41: from config.ru:3:in `block in <main>'
181
40: from /var/lib/gems/2.7.0/gems/activesupport-6.1.4.7/lib/active_support/dependencies.rb:332:in `require'
182
39: from /var/lib/gems/2.7.0/gems/activesupport-6.1.4.7/lib/active_support/dependencies.rb:299:in `load_dependency'
183
38: from /var/lib/gems/2.7.0/gems/activesupport-6.1.4.7/lib/active_support/dependencies.rb:332:in `block in require'
184
37: from /var/lib/gems/2.7.0/gems/zeitwerk-2.5.4/lib/zeitwerk/kernel.rb:35:in `require'
185
36: from /var/lib/gems/2.7.0/gems/zeitwerk-2.5.4/lib/zeitwerk/kernel.rb:35:in `require'
186
35: from /usr/share/redmine-5.0.0_plugins/config/environment.rb:16:in `<top (required)>'
187
34: from /var/lib/gems/2.7.0/gems/railties-6.1.4.7/lib/rails/application.rb:391:in `initialize!'
188
33: from /var/lib/gems/2.7.0/gems/railties-6.1.4.7/lib/rails/initializable.rb:60:in `run_initializers'
189
32: from /usr/lib/ruby/2.7.0/tsort.rb:205:in `tsort_each'
190
31: from /usr/lib/ruby/2.7.0/tsort.rb:226:in `tsort_each'
191
30: from /usr/lib/ruby/2.7.0/tsort.rb:347:in `each_strongly_connected_component'
192
29: from /usr/lib/ruby/2.7.0/tsort.rb:347:in `call'
193
28: from /usr/lib/ruby/2.7.0/tsort.rb:347:in `each'
194
27: from /usr/lib/ruby/2.7.0/tsort.rb:349:in `block in each_strongly_connected_component'
195
26: from /usr/lib/ruby/2.7.0/tsort.rb:431:in `each_strongly_connected_component_from'
196
25: from /usr/lib/ruby/2.7.0/tsort.rb:350:in `block (2 levels) in each_strongly_connected_component'
197
24: from /usr/lib/ruby/2.7.0/tsort.rb:228:in `block in tsort_each'
198
23: from /var/lib/gems/2.7.0/gems/railties-6.1.4.7/lib/rails/initializable.rb:61:in `block in run_initializers'
199
22: from /var/lib/gems/2.7.0/gems/railties-6.1.4.7/lib/rails/initializable.rb:32:in `run'
200
21: from /var/lib/gems/2.7.0/gems/railties-6.1.4.7/lib/rails/initializable.rb:32:in `instance_exec'
201
20: from /var/lib/gems/2.7.0/gems/railties-6.1.4.7/lib/rails/application/finisher.rb:124:in `block in <module:Finisher>'
202
19: from /var/lib/gems/2.7.0/gems/activesupport-6.1.4.7/lib/active_support/reloader.rb:88:in `prepare!'
203
18: from /var/lib/gems/2.7.0/gems/activesupport-6.1.4.7/lib/active_support/callbacks.rb:105:in `run_callbacks'
204
17: from /var/lib/gems/2.7.0/gems/activesupport-6.1.4.7/lib/active_support/callbacks.rb:512:in `invoke_before'
205
16: from /var/lib/gems/2.7.0/gems/activesupport-6.1.4.7/lib/active_support/callbacks.rb:512:in `each'
206
15: from /var/lib/gems/2.7.0/gems/activesupport-6.1.4.7/lib/active_support/callbacks.rb:512:in `block in invoke_before'
207
14: from /var/lib/gems/2.7.0/gems/activesupport-6.1.4.7/lib/active_support/callbacks.rb:199:in `block in halting'
208
13: from /var/lib/gems/2.7.0/gems/activesupport-6.1.4.7/lib/active_support/callbacks.rb:603:in `block in default_terminator'
209
12: from /var/lib/gems/2.7.0/gems/activesupport-6.1.4.7/lib/active_support/callbacks.rb:603:in `catch'
210
11: from /var/lib/gems/2.7.0/gems/activesupport-6.1.4.7/lib/active_support/callbacks.rb:604:in `block (2 levels) in default_terminator'
211
10: from /var/lib/gems/2.7.0/gems/activesupport-6.1.4.7/lib/active_support/callbacks.rb:198:in `block (2 levels) in halting'
212
 9: from /var/lib/gems/2.7.0/gems/activesupport-6.1.4.7/lib/active_support/callbacks.rb:427:in `block in make_lambda'
213
 8: from /var/lib/gems/2.7.0/gems/activesupport-6.1.4.7/lib/active_support/callbacks.rb:427:in `instance_exec'
214
 7: from /usr/share/redmine-5.0.0_plugins/lib/redmine/plugin_loader.rb:108:in `block in load'
215
 6: from /usr/share/redmine-5.0.0_plugins/lib/redmine/plugin_loader.rb:108:in `each'
216
 5: from /usr/share/redmine-5.0.0_plugins/lib/redmine/plugin_loader.rb:31:in `run_initializer'
217
 4: from /usr/share/redmine-5.0.0_plugins/lib/redmine/plugin_loader.rb:31:in `load'
218
 3: from /usr/share/redmine-5.0.0_plugins/plugins/redmine_subproject_collapse/init.rb:2:in `<top (required)>'
219
 2: from /var/lib/gems/2.7.0/gems/activesupport-6.1.4.7/lib/active_support/dependencies/zeitwerk_integration.rb:51:in `require_dependency'
220
 1: from /var/lib/gems/2.7.0/gems/zeitwerk-2.5.4/lib/zeitwerk/kernel.rb:35:in `require'
221
/var/lib/gems/2.7.0/gems/zeitwerk-2.5.4/lib/zeitwerk/kernel.rb:35:in `require': cannot load such file -- subproject_hook_listener (LoadError)
222

    
223
-----------------------------------------------------------------------------------
224
Failed-Plugins:redmine_drawio 
225
-----------------------------------------------------------------------------------
226
----- 1.3.0 ----- (latest)
227
	***for macro drawio_dmsf make sure to install the DMSF plugin and to enable the module for the project
228
Traceback (most recent call last):
229
        65: from bin/rails:4:in `<main>'
230
        64: from bin/rails:4:in `require'
231
        63: from /var/lib/gems/2.7.0/gems/railties-6.1.4.7/lib/rails/commands.rb:18:in `<top (required)>'
232
        62: from /var/lib/gems/2.7.0/gems/railties-6.1.4.7/lib/rails/command.rb:48:in `invoke'
233
        61: from /var/lib/gems/2.7.0/gems/railties-6.1.4.7/lib/rails/command/base.rb:69:in `perform'
234
        60: from /var/lib/gems/2.7.0/gems/thor-1.2.1/lib/thor.rb:392:in `dispatch'
235
        59: from /var/lib/gems/2.7.0/gems/thor-1.2.1/lib/thor/invocation.rb:127:in `invoke_command'
236
        58: from /var/lib/gems/2.7.0/gems/thor-1.2.1/lib/thor/command.rb:27:in `run'
237
        57: from /var/lib/gems/2.7.0/gems/railties-6.1.4.7/lib/rails/commands/server/server_command.rb:135:in `perform'
238
        56: from /var/lib/gems/2.7.0/gems/railties-6.1.4.7/lib/rails/commands/server/server_command.rb:135:in `tap'
239
        55: from /var/lib/gems/2.7.0/gems/railties-6.1.4.7/lib/rails/commands/server/server_command.rb:144:in `block in perform'
240
        54: from /var/lib/gems/2.7.0/gems/railties-6.1.4.7/lib/rails/commands/server/server_command.rb:39:in `start'
241
        53: from /var/lib/gems/2.7.0/gems/rack-2.2.3/lib/rack/server.rb:311:in `start'
242
        52: from /var/lib/gems/2.7.0/gems/rack-2.2.3/lib/rack/server.rb:379:in `handle_profiling'
243
        51: from /var/lib/gems/2.7.0/gems/rack-2.2.3/lib/rack/server.rb:312:in `block in start'
244
        50: from /var/lib/gems/2.7.0/gems/rack-2.2.3/lib/rack/server.rb:422:in `wrapped_app'
245
        49: from /var/lib/gems/2.7.0/gems/rack-2.2.3/lib/rack/server.rb:249:in `app'
246
        48: from /var/lib/gems/2.7.0/gems/rack-2.2.3/lib/rack/server.rb:349:in `build_app_and_options_from_config'
247
        47: from /var/lib/gems/2.7.0/gems/rack-2.2.3/lib/rack/builder.rb:66:in `parse_file'
248
        46: from /var/lib/gems/2.7.0/gems/rack-2.2.3/lib/rack/builder.rb:105:in `load_file'
249
        45: from /var/lib/gems/2.7.0/gems/rack-2.2.3/lib/rack/builder.rb:116:in `new_from_string'
250
        44: from /var/lib/gems/2.7.0/gems/rack-2.2.3/lib/rack/builder.rb:116:in `eval'
251
        43: from config.ru:3:in `block in <main>'
252
        42: from /var/lib/gems/2.7.0/gems/activesupport-6.1.4.7/lib/active_support/dependencies.rb:332:in `require'
253
        41: from /var/lib/gems/2.7.0/gems/activesupport-6.1.4.7/lib/active_support/dependencies.rb:299:in `load_dependency'
254
        40: from /var/lib/gems/2.7.0/gems/activesupport-6.1.4.7/lib/active_support/dependencies.rb:332:in `block in require'
255
        39: from /var/lib/gems/2.7.0/gems/zeitwerk-2.5.4/lib/zeitwerk/kernel.rb:35:in `require'
256
        38: from /var/lib/gems/2.7.0/gems/zeitwerk-2.5.4/lib/zeitwerk/kernel.rb:35:in `require'
257
        37: from /usr/share/redmine-5.0.0_plugins/config/environment.rb:16:in `<top (required)>'
258
        36: from /var/lib/gems/2.7.0/gems/railties-6.1.4.7/lib/rails/application.rb:391:in `initialize!'
259
        35: from /var/lib/gems/2.7.0/gems/railties-6.1.4.7/lib/rails/initializable.rb:60:in `run_initializers'
260
        34: from /usr/lib/ruby/2.7.0/tsort.rb:205:in `tsort_each'
261
        33: from /usr/lib/ruby/2.7.0/tsort.rb:226:in `tsort_each'
262
        32: from /usr/lib/ruby/2.7.0/tsort.rb:347:in `each_strongly_connected_component'
263
        31: from /usr/lib/ruby/2.7.0/tsort.rb:347:in `call'
264
        30: from /usr/lib/ruby/2.7.0/tsort.rb:347:in `each'
265
        29: from /usr/lib/ruby/2.7.0/tsort.rb:349:in `block in each_strongly_connected_component'
266
        28: from /usr/lib/ruby/2.7.0/tsort.rb:431:in `each_strongly_connected_component_from'
267
        27: from /usr/lib/ruby/2.7.0/tsort.rb:350:in `block (2 levels) in each_strongly_connected_component'
268
        26: from /usr/lib/ruby/2.7.0/tsort.rb:228:in `block in tsort_each'
269
        25: from /var/lib/gems/2.7.0/gems/railties-6.1.4.7/lib/rails/initializable.rb:61:in `block in run_initializers'
270
        24: from /var/lib/gems/2.7.0/gems/railties-6.1.4.7/lib/rails/initializable.rb:32:in `run'
271
        23: from /var/lib/gems/2.7.0/gems/railties-6.1.4.7/lib/rails/initializable.rb:32:in `instance_exec'
272
        22: from /var/lib/gems/2.7.0/gems/railties-6.1.4.7/lib/rails/application/finisher.rb:124:in `block in <module:Finisher>'
273
        21: from /var/lib/gems/2.7.0/gems/activesupport-6.1.4.7/lib/active_support/reloader.rb:88:in `prepare!'
274
        20: from /var/lib/gems/2.7.0/gems/activesupport-6.1.4.7/lib/active_support/callbacks.rb:105:in `run_callbacks'
275
        19: from /var/lib/gems/2.7.0/gems/activesupport-6.1.4.7/lib/active_support/callbacks.rb:512:in `invoke_before'
276
        18: from /var/lib/gems/2.7.0/gems/activesupport-6.1.4.7/lib/active_support/callbacks.rb:512:in `each'
277
        17: from /var/lib/gems/2.7.0/gems/activesupport-6.1.4.7/lib/active_support/callbacks.rb:512:in `block in invoke_before'
278
        16: from /var/lib/gems/2.7.0/gems/activesupport-6.1.4.7/lib/active_support/callbacks.rb:199:in `block in halting'
279
        15: from /var/lib/gems/2.7.0/gems/activesupport-6.1.4.7/lib/active_support/callbacks.rb:603:in `block in default_terminator'
280
        14: from /var/lib/gems/2.7.0/gems/activesupport-6.1.4.7/lib/active_support/callbacks.rb:603:in `catch'
281
        13: from /var/lib/gems/2.7.0/gems/activesupport-6.1.4.7/lib/active_support/callbacks.rb:604:in `block (2 levels) in default_terminator'
282
        12: from /var/lib/gems/2.7.0/gems/activesupport-6.1.4.7/lib/active_support/callbacks.rb:198:in `block (2 levels) in halting'
283
        11: from /var/lib/gems/2.7.0/gems/activesupport-6.1.4.7/lib/active_support/callbacks.rb:427:in `block in make_lambda'
284
        10: from /var/lib/gems/2.7.0/gems/activesupport-6.1.4.7/lib/active_support/callbacks.rb:427:in `instance_exec'
285
         9: from /usr/share/redmine-5.0.0_plugins/lib/redmine/plugin_loader.rb:108:in `block in load'
286
         8: from /usr/share/redmine-5.0.0_plugins/lib/redmine/plugin_loader.rb:108:in `each'
287
         7: from /usr/share/redmine-5.0.0_plugins/lib/redmine/plugin_loader.rb:31:in `run_initializer'
288
         6: from /usr/share/redmine-5.0.0_plugins/lib/redmine/plugin_loader.rb:31:in `load'
289
         5: from /usr/share/redmine-5.0.0_plugins/plugins/redmine_drawio/init.rb:23:in `<top (required)>'
290
         4: from /usr/share/redmine-5.0.0_plugins/plugins/redmine_drawio/init.rb:23:in `require_relative'
291
         3: from /usr/share/redmine-5.0.0_plugins/plugins/redmine_drawio/after_init.rb:2:in `<top (required)>'
292
         2: from /var/lib/gems/2.7.0/gems/activesupport-6.1.4.7/lib/active_support/dependencies/zeitwerk_integration.rb:51:in `require_dependency'
293
         1: from /var/lib/gems/2.7.0/gems/zeitwerk-2.5.4/lib/zeitwerk/kernel.rb:35:in `require'
294
/var/lib/gems/2.7.0/gems/zeitwerk-2.5.4/lib/zeitwerk/kernel.rb:35:in `require': cannot load such file -- redmine_drawio (LoadError)
295

    
296
-----------------------------------------------------------------------------------
297
Failed-Plugins:redmine_questions
298
-----------------------------------------------------------------------------------
299
----- 1.0.2 ----- (latest)
300
Traceback (most recent call last):
301
        62: from bin/rails:4:in `<main>'
302
        61: from bin/rails:4:in `require'
303
        60: from /var/lib/gems/2.7.0/gems/railties-6.1.4.7/lib/rails/commands.rb:18:in `<top (required)>'
304
        59: from /var/lib/gems/2.7.0/gems/railties-6.1.4.7/lib/rails/command.rb:48:in `invoke'
305
        58: from /var/lib/gems/2.7.0/gems/railties-6.1.4.7/lib/rails/command/base.rb:69:in `perform'
306
        57: from /var/lib/gems/2.7.0/gems/thor-1.2.1/lib/thor.rb:392:in `dispatch'
307
        56: from /var/lib/gems/2.7.0/gems/thor-1.2.1/lib/thor/invocation.rb:127:in `invoke_command'
308
        55: from /var/lib/gems/2.7.0/gems/thor-1.2.1/lib/thor/command.rb:27:in `run'
309
        54: from /var/lib/gems/2.7.0/gems/railties-6.1.4.7/lib/rails/commands/server/server_command.rb:135:in `perform'
310
        53: from /var/lib/gems/2.7.0/gems/railties-6.1.4.7/lib/rails/commands/server/server_command.rb:135:in `tap'
311
        52: from /var/lib/gems/2.7.0/gems/railties-6.1.4.7/lib/rails/commands/server/server_command.rb:144:in `block in perform'
312
        51: from /var/lib/gems/2.7.0/gems/railties-6.1.4.7/lib/rails/commands/server/server_command.rb:39:in `start'
313
        50: from /var/lib/gems/2.7.0/gems/rack-2.2.3/lib/rack/server.rb:311:in `start'
314
        49: from /var/lib/gems/2.7.0/gems/rack-2.2.3/lib/rack/server.rb:379:in `handle_profiling'
315
        48: from /var/lib/gems/2.7.0/gems/rack-2.2.3/lib/rack/server.rb:312:in `block in start'
316
        47: from /var/lib/gems/2.7.0/gems/rack-2.2.3/lib/rack/server.rb:422:in `wrapped_app'
317
        46: from /var/lib/gems/2.7.0/gems/rack-2.2.3/lib/rack/server.rb:249:in `app'
318
        45: from /var/lib/gems/2.7.0/gems/rack-2.2.3/lib/rack/server.rb:349:in `build_app_and_options_from_config'
319
        44: from /var/lib/gems/2.7.0/gems/rack-2.2.3/lib/rack/builder.rb:66:in `parse_file'
320
        43: from /var/lib/gems/2.7.0/gems/rack-2.2.3/lib/rack/builder.rb:105:in `load_file'
321
        42: from /var/lib/gems/2.7.0/gems/rack-2.2.3/lib/rack/builder.rb:116:in `new_from_string'
322
        41: from /var/lib/gems/2.7.0/gems/rack-2.2.3/lib/rack/builder.rb:116:in `eval'
323
        40: from config.ru:3:in `block in <main>'
324
        39: from /var/lib/gems/2.7.0/gems/activesupport-6.1.4.7/lib/active_support/dependencies.rb:332:in `require'
325
        38: from /var/lib/gems/2.7.0/gems/activesupport-6.1.4.7/lib/active_support/dependencies.rb:299:in `load_dependency'
326
        37: from /var/lib/gems/2.7.0/gems/activesupport-6.1.4.7/lib/active_support/dependencies.rb:332:in `block in require'
327
        36: from /var/lib/gems/2.7.0/gems/zeitwerk-2.5.4/lib/zeitwerk/kernel.rb:35:in `require'
328
        35: from /var/lib/gems/2.7.0/gems/zeitwerk-2.5.4/lib/zeitwerk/kernel.rb:35:in `require'
329
        34: from /usr/share/redmine-5.0.0_plugins/config/environment.rb:16:in `<top (required)>'
330
        33: from /var/lib/gems/2.7.0/gems/railties-6.1.4.7/lib/rails/application.rb:391:in `initialize!'
331
        32: from /var/lib/gems/2.7.0/gems/railties-6.1.4.7/lib/rails/initializable.rb:60:in `run_initializers'
332
        31: from /usr/lib/ruby/2.7.0/tsort.rb:205:in `tsort_each'
333
        30: from /usr/lib/ruby/2.7.0/tsort.rb:226:in `tsort_each'
334
        29: from /usr/lib/ruby/2.7.0/tsort.rb:347:in `each_strongly_connected_component'
335
        28: from /usr/lib/ruby/2.7.0/tsort.rb:347:in `call'
336
        27: from /usr/lib/ruby/2.7.0/tsort.rb:347:in `each'
337
        26: from /usr/lib/ruby/2.7.0/tsort.rb:349:in `block in each_strongly_connected_component'
338
        25: from /usr/lib/ruby/2.7.0/tsort.rb:431:in `each_strongly_connected_component_from'
339
        24: from /usr/lib/ruby/2.7.0/tsort.rb:350:in `block (2 levels) in each_strongly_connected_component'
340
        23: from /usr/lib/ruby/2.7.0/tsort.rb:228:in `block in tsort_each'
341
        22: from /var/lib/gems/2.7.0/gems/railties-6.1.4.7/lib/rails/initializable.rb:61:in `block in run_initializers'
342
        21: from /var/lib/gems/2.7.0/gems/railties-6.1.4.7/lib/rails/initializable.rb:32:in `run'
343
        20: from /var/lib/gems/2.7.0/gems/railties-6.1.4.7/lib/rails/initializable.rb:32:in `instance_exec'
344
        19: from /var/lib/gems/2.7.0/gems/railties-6.1.4.7/lib/rails/application/finisher.rb:124:in `block in <module:Finisher>'
345
        18: from /var/lib/gems/2.7.0/gems/activesupport-6.1.4.7/lib/active_support/reloader.rb:88:in `prepare!'
346
        17: from /var/lib/gems/2.7.0/gems/activesupport-6.1.4.7/lib/active_support/callbacks.rb:105:in `run_callbacks'
347
        16: from /var/lib/gems/2.7.0/gems/activesupport-6.1.4.7/lib/active_support/callbacks.rb:512:in `invoke_before'
348
        15: from /var/lib/gems/2.7.0/gems/activesupport-6.1.4.7/lib/active_support/callbacks.rb:512:in `each'
349
        14: from /var/lib/gems/2.7.0/gems/activesupport-6.1.4.7/lib/active_support/callbacks.rb:512:in `block in invoke_before'
350
        13: from /var/lib/gems/2.7.0/gems/activesupport-6.1.4.7/lib/active_support/callbacks.rb:199:in `block in halting'
351
        12: from /var/lib/gems/2.7.0/gems/activesupport-6.1.4.7/lib/active_support/callbacks.rb:603:in `block in default_terminator'
352
        11: from /var/lib/gems/2.7.0/gems/activesupport-6.1.4.7/lib/active_support/callbacks.rb:603:in `catch'
353
        10: from /var/lib/gems/2.7.0/gems/activesupport-6.1.4.7/lib/active_support/callbacks.rb:604:in `block (2 levels) in default_terminator'
354
         9: from /var/lib/gems/2.7.0/gems/activesupport-6.1.4.7/lib/active_support/callbacks.rb:198:in `block (2 levels) in halting'
355
         8: from /var/lib/gems/2.7.0/gems/activesupport-6.1.4.7/lib/active_support/callbacks.rb:427:in `block in make_lambda'
356
         7: from /var/lib/gems/2.7.0/gems/activesupport-6.1.4.7/lib/active_support/callbacks.rb:427:in `instance_exec'
357
         6: from /usr/share/redmine-5.0.0_plugins/lib/redmine/plugin_loader.rb:108:in `block in load'
358
         5: from /usr/share/redmine-5.0.0_plugins/lib/redmine/plugin_loader.rb:108:in `each'
359
         4: from /usr/share/redmine-5.0.0_plugins/lib/redmine/plugin_loader.rb:31:in `run_initializer'
360
         3: from /usr/share/redmine-5.0.0_plugins/lib/redmine/plugin_loader.rb:31:in `load'
361
         2: from /usr/share/redmine-5.0.0_plugins/plugins/redmine_questions/init.rb:22:in `<top (required)>'
362
         1: from /var/lib/gems/2.7.0/gems/zeitwerk-2.5.4/lib/zeitwerk/kernel.rb:35:in `require'
363
/var/lib/gems/2.7.0/gems/zeitwerk-2.5.4/lib/zeitwerk/kernel.rb:35:in `require': cannot load such file -- redmine_questions (LoadError)
364

    
365
-----------------------------------------------------------------------------------
366
Done-Plugins:redmine_checklists
367
-----------------------------------------------------------------------------------
368
----- 3.1.21 ----- (latest)
369
Done
370

    
371
-----------------------------------------------------------------------------------
372
Failed-Plugins:redmine_resources
373
-----------------------------------------------------------------------------------
374
----- 1.0.6 ----- (latest)
375
Traceback (most recent call last):
376
        62: from bin/rails:4:in `<main>'
377
        61: from bin/rails:4:in `require'
378
        60: from /var/lib/gems/2.7.0/gems/railties-6.1.4.7/lib/rails/commands.rb:18:in `<top (required)>'
379
        59: from /var/lib/gems/2.7.0/gems/railties-6.1.4.7/lib/rails/command.rb:48:in `invoke'
380
        58: from /var/lib/gems/2.7.0/gems/railties-6.1.4.7/lib/rails/command/base.rb:69:in `perform'
381
        57: from /var/lib/gems/2.7.0/gems/thor-1.2.1/lib/thor.rb:392:in `dispatch'
382
        56: from /var/lib/gems/2.7.0/gems/thor-1.2.1/lib/thor/invocation.rb:127:in `invoke_command'
383
        55: from /var/lib/gems/2.7.0/gems/thor-1.2.1/lib/thor/command.rb:27:in `run'
384
        54: from /var/lib/gems/2.7.0/gems/railties-6.1.4.7/lib/rails/commands/server/server_command.rb:135:in `perform'
385
        53: from /var/lib/gems/2.7.0/gems/railties-6.1.4.7/lib/rails/commands/server/server_command.rb:135:in `tap'
386
        52: from /var/lib/gems/2.7.0/gems/railties-6.1.4.7/lib/rails/commands/server/server_command.rb:144:in `block in perform'
387
        51: from /var/lib/gems/2.7.0/gems/railties-6.1.4.7/lib/rails/commands/server/server_command.rb:39:in `start'
388
        50: from /var/lib/gems/2.7.0/gems/rack-2.2.3/lib/rack/server.rb:311:in `start'
389
        49: from /var/lib/gems/2.7.0/gems/rack-2.2.3/lib/rack/server.rb:379:in `handle_profiling'
390
        48: from /var/lib/gems/2.7.0/gems/rack-2.2.3/lib/rack/server.rb:312:in `block in start'
391
        47: from /var/lib/gems/2.7.0/gems/rack-2.2.3/lib/rack/server.rb:422:in `wrapped_app'
392
        46: from /var/lib/gems/2.7.0/gems/rack-2.2.3/lib/rack/server.rb:249:in `app'
393
        45: from /var/lib/gems/2.7.0/gems/rack-2.2.3/lib/rack/server.rb:349:in `build_app_and_options_from_config'
394
        44: from /var/lib/gems/2.7.0/gems/rack-2.2.3/lib/rack/builder.rb:66:in `parse_file'
395
        43: from /var/lib/gems/2.7.0/gems/rack-2.2.3/lib/rack/builder.rb:105:in `load_file'
396
        42: from /var/lib/gems/2.7.0/gems/rack-2.2.3/lib/rack/builder.rb:116:in `new_from_string'
397
        41: from /var/lib/gems/2.7.0/gems/rack-2.2.3/lib/rack/builder.rb:116:in `eval'
398
        40: from config.ru:3:in `block in <main>'
399
        39: from /var/lib/gems/2.7.0/gems/activesupport-6.1.4.7/lib/active_support/dependencies.rb:332:in `require'
400
        38: from /var/lib/gems/2.7.0/gems/activesupport-6.1.4.7/lib/active_support/dependencies.rb:299:in `load_dependency'
401
        37: from /var/lib/gems/2.7.0/gems/activesupport-6.1.4.7/lib/active_support/dependencies.rb:332:in `block in require'
402
        36: from /var/lib/gems/2.7.0/gems/zeitwerk-2.5.4/lib/zeitwerk/kernel.rb:35:in `require'
403
        35: from /var/lib/gems/2.7.0/gems/zeitwerk-2.5.4/lib/zeitwerk/kernel.rb:35:in `require'
404
        34: from /usr/share/redmine-5.0.0_plugins/config/environment.rb:16:in `<top (required)>'
405
        33: from /var/lib/gems/2.7.0/gems/railties-6.1.4.7/lib/rails/application.rb:391:in `initialize!'
406
        32: from /var/lib/gems/2.7.0/gems/railties-6.1.4.7/lib/rails/initializable.rb:60:in `run_initializers'
407
        31: from /usr/lib/ruby/2.7.0/tsort.rb:205:in `tsort_each'
408
        30: from /usr/lib/ruby/2.7.0/tsort.rb:226:in `tsort_each'
409
        29: from /usr/lib/ruby/2.7.0/tsort.rb:347:in `each_strongly_connected_component'
410
        28: from /usr/lib/ruby/2.7.0/tsort.rb:347:in `call'
411
        27: from /usr/lib/ruby/2.7.0/tsort.rb:347:in `each'
412
        26: from /usr/lib/ruby/2.7.0/tsort.rb:349:in `block in each_strongly_connected_component'
413
        25: from /usr/lib/ruby/2.7.0/tsort.rb:431:in `each_strongly_connected_component_from'
414
        24: from /usr/lib/ruby/2.7.0/tsort.rb:350:in `block (2 levels) in each_strongly_connected_component'
415
        23: from /usr/lib/ruby/2.7.0/tsort.rb:228:in `block in tsort_each'
416
        22: from /var/lib/gems/2.7.0/gems/railties-6.1.4.7/lib/rails/initializable.rb:61:in `block in run_initializers'
417
        21: from /var/lib/gems/2.7.0/gems/railties-6.1.4.7/lib/rails/initializable.rb:32:in `run'
418
        20: from /var/lib/gems/2.7.0/gems/railties-6.1.4.7/lib/rails/initializable.rb:32:in `instance_exec'
419
        19: from /var/lib/gems/2.7.0/gems/railties-6.1.4.7/lib/rails/application/finisher.rb:124:in `block in <module:Finisher>'
420
        18: from /var/lib/gems/2.7.0/gems/activesupport-6.1.4.7/lib/active_support/reloader.rb:88:in `prepare!'
421
        17: from /var/lib/gems/2.7.0/gems/activesupport-6.1.4.7/lib/active_support/callbacks.rb:105:in `run_callbacks'
422
        16: from /var/lib/gems/2.7.0/gems/activesupport-6.1.4.7/lib/active_support/callbacks.rb:512:in `invoke_before'
423
        15: from /var/lib/gems/2.7.0/gems/activesupport-6.1.4.7/lib/active_support/callbacks.rb:512:in `each'
424
        14: from /var/lib/gems/2.7.0/gems/activesupport-6.1.4.7/lib/active_support/callbacks.rb:512:in `block in invoke_before'
425
        13: from /var/lib/gems/2.7.0/gems/activesupport-6.1.4.7/lib/active_support/callbacks.rb:199:in `block in halting'
426
        12: from /var/lib/gems/2.7.0/gems/activesupport-6.1.4.7/lib/active_support/callbacks.rb:603:in `block in default_terminator'
427
        11: from /var/lib/gems/2.7.0/gems/activesupport-6.1.4.7/lib/active_support/callbacks.rb:603:in `catch'
428
        10: from /var/lib/gems/2.7.0/gems/activesupport-6.1.4.7/lib/active_support/callbacks.rb:604:in `block (2 levels) in default_terminator'
429
         9: from /var/lib/gems/2.7.0/gems/activesupport-6.1.4.7/lib/active_support/callbacks.rb:198:in `block (2 levels) in halting'
430
         8: from /var/lib/gems/2.7.0/gems/activesupport-6.1.4.7/lib/active_support/callbacks.rb:427:in `block in make_lambda'
431
         7: from /var/lib/gems/2.7.0/gems/activesupport-6.1.4.7/lib/active_support/callbacks.rb:427:in `instance_exec'
432
         6: from /usr/share/redmine-5.0.0_plugins/lib/redmine/plugin_loader.rb:108:in `block in load'
433
         5: from /usr/share/redmine-5.0.0_plugins/lib/redmine/plugin_loader.rb:108:in `each'
434
         4: from /usr/share/redmine-5.0.0_plugins/lib/redmine/plugin_loader.rb:31:in `run_initializer'
435
         3: from /usr/share/redmine-5.0.0_plugins/lib/redmine/plugin_loader.rb:31:in `load'
436
         2: from /usr/share/redmine-5.0.0_plugins/plugins/redmine_resources/init.rb:21:in `<top (required)>'
437
         1: from /var/lib/gems/2.7.0/gems/zeitwerk-2.5.4/lib/zeitwerk/kernel.rb:35:in `require'
438
/var/lib/gems/2.7.0/gems/zeitwerk-2.5.4/lib/zeitwerk/kernel.rb:35:in `require': cannot load such file -- redmine_resources (LoadError)
439

    
440
-----------------------------------------------------------------------------------
441
Failed-Plugins:redmineup_tags
442
-----------------------------------------------------------------------------------
443
----- 2.0.11 ----- (latest)
444
Traceback (most recent call last):
445
        62: from bin/rails:4:in `<main>'
446
        61: from bin/rails:4:in `require'
447
        60: from /var/lib/gems/2.7.0/gems/railties-6.1.4.7/lib/rails/commands.rb:18:in `<top (required)>'
448
        59: from /var/lib/gems/2.7.0/gems/railties-6.1.4.7/lib/rails/command.rb:48:in `invoke'
449
        58: from /var/lib/gems/2.7.0/gems/railties-6.1.4.7/lib/rails/command/base.rb:69:in `perform'
450
        57: from /var/lib/gems/2.7.0/gems/thor-1.2.1/lib/thor.rb:392:in `dispatch'
451
        56: from /var/lib/gems/2.7.0/gems/thor-1.2.1/lib/thor/invocation.rb:127:in `invoke_command'
452
        55: from /var/lib/gems/2.7.0/gems/thor-1.2.1/lib/thor/command.rb:27:in `run'
453
        54: from /var/lib/gems/2.7.0/gems/railties-6.1.4.7/lib/rails/commands/server/server_command.rb:135:in `perform'
454
        53: from /var/lib/gems/2.7.0/gems/railties-6.1.4.7/lib/rails/commands/server/server_command.rb:135:in `tap'
455
        52: from /var/lib/gems/2.7.0/gems/railties-6.1.4.7/lib/rails/commands/server/server_command.rb:144:in `block in perform'
456
        51: from /var/lib/gems/2.7.0/gems/railties-6.1.4.7/lib/rails/commands/server/server_command.rb:39:in `start'
457
        50: from /var/lib/gems/2.7.0/gems/rack-2.2.3/lib/rack/server.rb:311:in `start'
458
        49: from /var/lib/gems/2.7.0/gems/rack-2.2.3/lib/rack/server.rb:379:in `handle_profiling'
459
        48: from /var/lib/gems/2.7.0/gems/rack-2.2.3/lib/rack/server.rb:312:in `block in start'
460
        47: from /var/lib/gems/2.7.0/gems/rack-2.2.3/lib/rack/server.rb:422:in `wrapped_app'
461
        46: from /var/lib/gems/2.7.0/gems/rack-2.2.3/lib/rack/server.rb:249:in `app'
462
        45: from /var/lib/gems/2.7.0/gems/rack-2.2.3/lib/rack/server.rb:349:in `build_app_and_options_from_config'
463
        44: from /var/lib/gems/2.7.0/gems/rack-2.2.3/lib/rack/builder.rb:66:in `parse_file'
464
        43: from /var/lib/gems/2.7.0/gems/rack-2.2.3/lib/rack/builder.rb:105:in `load_file'
465
        42: from /var/lib/gems/2.7.0/gems/rack-2.2.3/lib/rack/builder.rb:116:in `new_from_string'
466
        41: from /var/lib/gems/2.7.0/gems/rack-2.2.3/lib/rack/builder.rb:116:in `eval'
467
        40: from config.ru:3:in `block in <main>'
468
        39: from /var/lib/gems/2.7.0/gems/activesupport-6.1.4.7/lib/active_support/dependencies.rb:332:in `require'
469
        38: from /var/lib/gems/2.7.0/gems/activesupport-6.1.4.7/lib/active_support/dependencies.rb:299:in `load_dependency'
470
        37: from /var/lib/gems/2.7.0/gems/activesupport-6.1.4.7/lib/active_support/dependencies.rb:332:in `block in require'
471
        36: from /var/lib/gems/2.7.0/gems/zeitwerk-2.5.4/lib/zeitwerk/kernel.rb:35:in `require'
472
        35: from /var/lib/gems/2.7.0/gems/zeitwerk-2.5.4/lib/zeitwerk/kernel.rb:35:in `require'
473
        34: from /usr/share/redmine-5.0.0_plugins/config/environment.rb:16:in `<top (required)>'
474
        33: from /var/lib/gems/2.7.0/gems/railties-6.1.4.7/lib/rails/application.rb:391:in `initialize!'
475
        32: from /var/lib/gems/2.7.0/gems/railties-6.1.4.7/lib/rails/initializable.rb:60:in `run_initializers'
476
        31: from /usr/lib/ruby/2.7.0/tsort.rb:205:in `tsort_each'
477
        30: from /usr/lib/ruby/2.7.0/tsort.rb:226:in `tsort_each'
478
        29: from /usr/lib/ruby/2.7.0/tsort.rb:347:in `each_strongly_connected_component'
479
        28: from /usr/lib/ruby/2.7.0/tsort.rb:347:in `call'
480
        27: from /usr/lib/ruby/2.7.0/tsort.rb:347:in `each'
481
        26: from /usr/lib/ruby/2.7.0/tsort.rb:349:in `block in each_strongly_connected_component'
482
        25: from /usr/lib/ruby/2.7.0/tsort.rb:431:in `each_strongly_connected_component_from'
483
        24: from /usr/lib/ruby/2.7.0/tsort.rb:350:in `block (2 levels) in each_strongly_connected_component'
484
        23: from /usr/lib/ruby/2.7.0/tsort.rb:228:in `block in tsort_each'
485
        22: from /var/lib/gems/2.7.0/gems/railties-6.1.4.7/lib/rails/initializable.rb:61:in `block in run_initializers'
486
        21: from /var/lib/gems/2.7.0/gems/railties-6.1.4.7/lib/rails/initializable.rb:32:in `run'
487
        20: from /var/lib/gems/2.7.0/gems/railties-6.1.4.7/lib/rails/initializable.rb:32:in `instance_exec'
488
        19: from /var/lib/gems/2.7.0/gems/railties-6.1.4.7/lib/rails/application/finisher.rb:124:in `block in <module:Finisher>'
489
        18: from /var/lib/gems/2.7.0/gems/activesupport-6.1.4.7/lib/active_support/reloader.rb:88:in `prepare!'
490
        17: from /var/lib/gems/2.7.0/gems/activesupport-6.1.4.7/lib/active_support/callbacks.rb:105:in `run_callbacks'
491
        16: from /var/lib/gems/2.7.0/gems/activesupport-6.1.4.7/lib/active_support/callbacks.rb:512:in `invoke_before'
492
        15: from /var/lib/gems/2.7.0/gems/activesupport-6.1.4.7/lib/active_support/callbacks.rb:512:in `each'
493
        14: from /var/lib/gems/2.7.0/gems/activesupport-6.1.4.7/lib/active_support/callbacks.rb:512:in `block in invoke_before'
494
        13: from /var/lib/gems/2.7.0/gems/activesupport-6.1.4.7/lib/active_support/callbacks.rb:199:in `block in halting'
495
        12: from /var/lib/gems/2.7.0/gems/activesupport-6.1.4.7/lib/active_support/callbacks.rb:603:in `block in default_terminator'
496
        11: from /var/lib/gems/2.7.0/gems/activesupport-6.1.4.7/lib/active_support/callbacks.rb:603:in `catch'
497
        10: from /var/lib/gems/2.7.0/gems/activesupport-6.1.4.7/lib/active_support/callbacks.rb:604:in `block (2 levels) in default_terminator'
498
         9: from /var/lib/gems/2.7.0/gems/activesupport-6.1.4.7/lib/active_support/callbacks.rb:198:in `block (2 levels) in halting'
499
         8: from /var/lib/gems/2.7.0/gems/activesupport-6.1.4.7/lib/active_support/callbacks.rb:427:in `block in make_lambda'
500
         7: from /var/lib/gems/2.7.0/gems/activesupport-6.1.4.7/lib/active_support/callbacks.rb:427:in `instance_exec'
501
         6: from /usr/share/redmine-5.0.0_plugins/lib/redmine/plugin_loader.rb:108:in `block in load'
502
         5: from /usr/share/redmine-5.0.0_plugins/lib/redmine/plugin_loader.rb:108:in `each'
503
         4: from /usr/share/redmine-5.0.0_plugins/lib/redmine/plugin_loader.rb:31:in `run_initializer'
504
         3: from /usr/share/redmine-5.0.0_plugins/lib/redmine/plugin_loader.rb:31:in `load'
505
         2: from /usr/share/redmine-5.0.0_plugins/plugins/redmineup_tags/init.rb:53:in `<top (required)>'
506
         1: from /var/lib/gems/2.7.0/gems/zeitwerk-2.5.4/lib/zeitwerk/kernel.rb:35:in `require'
507
/var/lib/gems/2.7.0/gems/zeitwerk-2.5.4/lib/zeitwerk/kernel.rb:35:in `require': cannot load such file -- redmineup_tags (LoadError)
508

    
509
-----------------------------------------------------------------------------------
510
Done-Plugins:redmine_agile
511
-----------------------------------------------------------------------------------
512
----- 1.6.3 -----
513
Done
514

    
515
----- 1.6.2 -----
516
Traceback (most recent call last):
517
        62: from bin/rails:4:in `<main>'
518
        61: from bin/rails:4:in `require'
519
        60: from /var/lib/gems/2.7.0/gems/railties-6.1.4.7/lib/rails/commands.rb:18:in `<top (required)>'
520
        59: from /var/lib/gems/2.7.0/gems/railties-6.1.4.7/lib/rails/command.rb:48:in `invoke'
521
        58: from /var/lib/gems/2.7.0/gems/railties-6.1.4.7/lib/rails/command/base.rb:69:in `perform'
522
        57: from /var/lib/gems/2.7.0/gems/thor-1.2.1/lib/thor.rb:392:in `dispatch'
523
        56: from /var/lib/gems/2.7.0/gems/thor-1.2.1/lib/thor/invocation.rb:127:in `invoke_command'
524
        55: from /var/lib/gems/2.7.0/gems/thor-1.2.1/lib/thor/command.rb:27:in `run'
525
        54: from /var/lib/gems/2.7.0/gems/railties-6.1.4.7/lib/rails/commands/server/server_command.rb:135:in `perform'
526
        53: from /var/lib/gems/2.7.0/gems/railties-6.1.4.7/lib/rails/commands/server/server_command.rb:135:in `tap'
527
        52: from /var/lib/gems/2.7.0/gems/railties-6.1.4.7/lib/rails/commands/server/server_command.rb:144:in `block in perform'
528
        51: from /var/lib/gems/2.7.0/gems/railties-6.1.4.7/lib/rails/commands/server/server_command.rb:39:in `start'
529
        50: from /var/lib/gems/2.7.0/gems/rack-2.2.3/lib/rack/server.rb:311:in `start'
530
        49: from /var/lib/gems/2.7.0/gems/rack-2.2.3/lib/rack/server.rb:379:in `handle_profiling'
531
        48: from /var/lib/gems/2.7.0/gems/rack-2.2.3/lib/rack/server.rb:312:in `block in start'
532
        47: from /var/lib/gems/2.7.0/gems/rack-2.2.3/lib/rack/server.rb:422:in `wrapped_app'
533
        46: from /var/lib/gems/2.7.0/gems/rack-2.2.3/lib/rack/server.rb:249:in `app'
534
        45: from /var/lib/gems/2.7.0/gems/rack-2.2.3/lib/rack/server.rb:349:in `build_app_and_options_from_config'
535
        44: from /var/lib/gems/2.7.0/gems/rack-2.2.3/lib/rack/builder.rb:66:in `parse_file'
536
        43: from /var/lib/gems/2.7.0/gems/rack-2.2.3/lib/rack/builder.rb:105:in `load_file'
537
        42: from /var/lib/gems/2.7.0/gems/rack-2.2.3/lib/rack/builder.rb:116:in `new_from_string'
538
        41: from /var/lib/gems/2.7.0/gems/rack-2.2.3/lib/rack/builder.rb:116:in `eval'
539
        40: from config.ru:3:in `block in <main>'
540
        39: from /var/lib/gems/2.7.0/gems/activesupport-6.1.4.7/lib/active_support/dependencies.rb:332:in `require'
541
        38: from /var/lib/gems/2.7.0/gems/activesupport-6.1.4.7/lib/active_support/dependencies.rb:299:in `load_dependency'
542
        37: from /var/lib/gems/2.7.0/gems/activesupport-6.1.4.7/lib/active_support/dependencies.rb:332:in `block in require'
543
        36: from /var/lib/gems/2.7.0/gems/zeitwerk-2.5.4/lib/zeitwerk/kernel.rb:35:in `require'
544
        35: from /var/lib/gems/2.7.0/gems/zeitwerk-2.5.4/lib/zeitwerk/kernel.rb:35:in `require'
545
        34: from /usr/share/redmine-5.0.0_plugins/config/environment.rb:16:in `<top (required)>'
546
        33: from /var/lib/gems/2.7.0/gems/railties-6.1.4.7/lib/rails/application.rb:391:in `initialize!'
547
        32: from /var/lib/gems/2.7.0/gems/railties-6.1.4.7/lib/rails/initializable.rb:60:in `run_initializers'
548
        31: from /usr/lib/ruby/2.7.0/tsort.rb:205:in `tsort_each'
549
        30: from /usr/lib/ruby/2.7.0/tsort.rb:226:in `tsort_each'
550
        29: from /usr/lib/ruby/2.7.0/tsort.rb:347:in `each_strongly_connected_component'
551
        28: from /usr/lib/ruby/2.7.0/tsort.rb:347:in `call'
552
        27: from /usr/lib/ruby/2.7.0/tsort.rb:347:in `each'
553
        26: from /usr/lib/ruby/2.7.0/tsort.rb:349:in `block in each_strongly_connected_component'
554
        25: from /usr/lib/ruby/2.7.0/tsort.rb:431:in `each_strongly_connected_component_from'
555
        24: from /usr/lib/ruby/2.7.0/tsort.rb:350:in `block (2 levels) in each_strongly_connected_component'
556
        23: from /usr/lib/ruby/2.7.0/tsort.rb:228:in `block in tsort_each'
557
        22: from /var/lib/gems/2.7.0/gems/railties-6.1.4.7/lib/rails/initializable.rb:61:in `block in run_initializers'
558
        21: from /var/lib/gems/2.7.0/gems/railties-6.1.4.7/lib/rails/initializable.rb:32:in `run'
559
        20: from /var/lib/gems/2.7.0/gems/railties-6.1.4.7/lib/rails/initializable.rb:32:in `instance_exec'
560
        19: from /var/lib/gems/2.7.0/gems/railties-6.1.4.7/lib/rails/application/finisher.rb:124:in `block in <module:Finisher>'
561
        18: from /var/lib/gems/2.7.0/gems/activesupport-6.1.4.7/lib/active_support/reloader.rb:88:in `prepare!'
562
        17: from /var/lib/gems/2.7.0/gems/activesupport-6.1.4.7/lib/active_support/callbacks.rb:105:in `run_callbacks'
563
        16: from /var/lib/gems/2.7.0/gems/activesupport-6.1.4.7/lib/active_support/callbacks.rb:512:in `invoke_before'
564
        15: from /var/lib/gems/2.7.0/gems/activesupport-6.1.4.7/lib/active_support/callbacks.rb:512:in `each'
565
        14: from /var/lib/gems/2.7.0/gems/activesupport-6.1.4.7/lib/active_support/callbacks.rb:512:in `block in invoke_before'
566
        13: from /var/lib/gems/2.7.0/gems/activesupport-6.1.4.7/lib/active_support/callbacks.rb:199:in `block in halting'
567
        12: from /var/lib/gems/2.7.0/gems/activesupport-6.1.4.7/lib/active_support/callbacks.rb:603:in `block in default_terminator'
568
        11: from /var/lib/gems/2.7.0/gems/activesupport-6.1.4.7/lib/active_support/callbacks.rb:603:in `catch'
569
        10: from /var/lib/gems/2.7.0/gems/activesupport-6.1.4.7/lib/active_support/callbacks.rb:604:in `block (2 levels) in default_terminator'
570
         9: from /var/lib/gems/2.7.0/gems/activesupport-6.1.4.7/lib/active_support/callbacks.rb:198:in `block (2 levels) in halting'
571
         8: from /var/lib/gems/2.7.0/gems/activesupport-6.1.4.7/lib/active_support/callbacks.rb:427:in `block in make_lambda'
572
         7: from /var/lib/gems/2.7.0/gems/activesupport-6.1.4.7/lib/active_support/callbacks.rb:427:in `instance_exec'
573
         6: from /usr/share/redmine-5.0.0_plugins/lib/redmine/plugin_loader.rb:108:in `block in load'
574
         5: from /usr/share/redmine-5.0.0_plugins/lib/redmine/plugin_loader.rb:108:in `each'
575
         4: from /usr/share/redmine-5.0.0_plugins/lib/redmine/plugin_loader.rb:31:in `run_initializer'
576
         3: from /usr/share/redmine-5.0.0_plugins/lib/redmine/plugin_loader.rb:31:in `load'
577
         2: from /usr/share/redmine-5.0.0_plugins/plugins/redmine_agile/init.rb:71:in `<top (required)>'
578
         1: from /var/lib/gems/2.7.0/gems/zeitwerk-2.5.4/lib/zeitwerk/kernel.rb:35:in `require'
579
/var/lib/gems/2.7.0/gems/zeitwerk-2.5.4/lib/zeitwerk/kernel.rb:35:in `require': cannot load such file -- redmine_agile (LoadError)
580

    
581
-----------------------------------------------------------------------------------
582
Failed-Plugins:redmine_dmsf
583
-----------------------------------------------------------------------------------
584
----- 2.4.11 ----- (latest)
585
Bundler could not find compatible versions for gem "rails":
586
  In snapshot (Gemfile.lock):
587
    rails (= 6.1.4.7)
588

    
589
  In Gemfile:
590
    rails (= 6.1.4.7)
591

    
592
    redmine_extensions (~> 0.3.9) was resolved to 0.3.11, which depends on
593
      rails (>= 4.2, < 6.1)
594

    
595
Running `bundle update` will rebuild your snapshot from scratch, using only
596
the gems in your Gemfile, which may resolve the conflict.